{"text_format":"1","workbook":"xlsx","n_sheets":2,"sheets":["Sheet1","商品データ"],"not_rendered":{"charts":0,"images":0,"macros":1,"external_links":0,"defined_names":0,"comments":0,"pivot_tables":0},"unopened":[],"bounds":{"document_bytes":16777216,"sheet_cells":100000,"rows_first":2000,"rows_last":500,"rows_between":2000,"halvings":0,"cell_chars":16384,"cell_head_chars":4096},"cells_cut":0,"cells_raw":0,"read":"whole","date_system":"1900"}

{"sheet":"Sheet1","index":0,"n_rows":11,"n_cols":5,"rows_kept":11,"cut":false,"hidden":false,"merged":[]}
["No.","商品コード","検索欄","商品名","サイズ"]
[1,null,null,{"$f":"IF($B2=\"\",\"\",IFERROR(INDEX(商品データ!B:B,MATCH(Sheet1!$B2,商品データ!$A:$A,0))& \"\",\"\"))","v":""},{"$f":"IF($B2=\"\",\"\",IFERROR(INDEX(商品データ!C:C,MATCH(Sheet1!$B2,商品データ!$A:$A,0))& \"\",\"\"))","v":""}]
[2,null,null,{"$f":"IF($B3=\"\",\"\",IFERROR(INDEX(商品データ!B:B,MATCH(Sheet1!$B3,商品データ!$A:$A,0))& \"\",\"\"))","v":""},{"$f":"IF($B3=\"\",\"\",IFERROR(INDEX(商品データ!C:C,MATCH(Sheet1!$B3,商品データ!$A:$A,0))& \"\",\"\"))","v":""}]
[3,null,null,{"$f":"IF($B4=\"\",\"\",IFERROR(INDEX(商品データ!B:B,MATCH(Sheet1!$B4,商品データ!$A:$A,0))& \"\",\"\"))","v":""},{"$f":"IF($B4=\"\",\"\",IFERROR(INDEX(商品データ!C:C,MATCH(Sheet1!$B4,商品データ!$A:$A,0))& \"\",\"\"))","v":""}]
[4,null,null,{"$f":"IF($B5=\"\",\"\",IFERROR(INDEX(商品データ!B:B,MATCH(Sheet1!$B5,商品データ!$A:$A,0))& \"\",\"\"))","v":""},{"$f":"IF($B5=\"\",\"\",IFERROR(INDEX(商品データ!C:C,MATCH(Sheet1!$B5,商品データ!$A:$A,0))& \"\",\"\"))","v":""}]
[5,null,null,{"$f":"IF($B6=\"\",\"\",IFERROR(INDEX(商品データ!B:B,MATCH(Sheet1!$B6,商品データ!$A:$A,0))& \"\",\"\"))","v":""},{"$f":"IF($B6=\"\",\"\",IFERROR(INDEX(商品データ!C:C,MATCH(Sheet1!$B6,商品データ!$A:$A,0))& \"\",\"\"))","v":""}]
[6,null,null,{"$f":"IF($B7=\"\",\"\",IFERROR(INDEX(商品データ!B:B,MATCH(Sheet1!$B7,商品データ!$A:$A,0))& \"\",\"\"))","v":""},{"$f":"IF($B7=\"\",\"\",IFERROR(INDEX(商品データ!C:C,MATCH(Sheet1!$B7,商品データ!$A:$A,0))& \"\",\"\"))","v":""}]
[7,null,null,{"$f":"IF($B8=\"\",\"\",IFERROR(INDEX(商品データ!B:B,MATCH(Sheet1!$B8,商品データ!$A:$A,0))& \"\",\"\"))","v":""},{"$f":"IF($B8=\"\",\"\",IFERROR(INDEX(商品データ!C:C,MATCH(Sheet1!$B8,商品データ!$A:$A,0))& \"\",\"\"))","v":""}]
[8,null,null,{"$f":"IF($B9=\"\",\"\",IFERROR(INDEX(商品データ!B:B,MATCH(Sheet1!$B9,商品データ!$A:$A,0))& \"\",\"\"))","v":""},{"$f":"IF($B9=\"\",\"\",IFERROR(INDEX(商品データ!C:C,MATCH(Sheet1!$B9,商品データ!$A:$A,0))& \"\",\"\"))","v":""}]
[9,null,null,{"$f":"IF($B10=\"\",\"\",IFERROR(INDEX(商品データ!B:B,MATCH(Sheet1!$B10,商品データ!$A:$A,0))& \"\",\"\"))","v":""},{"$f":"IF($B10=\"\",\"\",IFERROR(INDEX(商品データ!C:C,MATCH(Sheet1!$B10,商品データ!$A:$A,0))& \"\",\"\"))","v":""}]
[10,null,null,{"$f":"IF($B11=\"\",\"\",IFERROR(INDEX(商品データ!B:B,MATCH(Sheet1!$B11,商品データ!$A:$A,0))& \"\",\"\"))","v":""},{"$f":"IF($B11=\"\",\"\",IFERROR(INDEX(商品データ!C:C,MATCH(Sheet1!$B11,商品データ!$A:$A,0))& \"\",\"\"))","v":""}]

{"sheet":"商品データ","index":1,"n_rows":26,"n_cols":3,"rows_kept":26,"cut":false,"hidden":false,"merged":[]}
["商品コード","商品名","サイズ"]
["OW-150601","#○○○　カラー：ホワイト　サイズ：XS","XS"]
["OW-150602","#○○○　カラー：ホワイト　サイズ：S","S"]
["OW-150603","#○○○　カラー：ホワイト　サイズ：M","M"]
["OW-150604","#○○○　カラー：ホワイト　サイズ：L","L"]
["OW-150605","#○○○　カラー：ホワイト　サイズ：XL","XL"]
["OB-150611","#○○○　カラー：ブラック　サイズ：XS","XS"]
["OB-150612","#○○○　カラー：ブラック　サイズ：S","S"]
["OB-150613","#○○○　カラー：ブラック　サイズ：M","M"]
["OB-150614","#○○○　カラー：ブラック　サイズ：L","L"]
["OB-150615","#○○○　カラー：ブラック　サイズ：XL","XL"]
["OM-150621","#○○○　カラー：マゼンタ　サイズ：XS","XS"]
["OM-150622","#○○○　カラー：マゼンタ　サイズ：S","S"]
["OM-150623","#○○○　カラー：マゼンタ　サイズ：M","M"]
["OM-150624","#○○○　カラー：マゼンタ　サイズ：L","L"]
["OM-150625","#○○○　カラー：マゼンタ　サイズ：XL","XL"]
["OC-150631","#○○○　カラー：シアン　サイズ：XS","XS"]
["OC-150632","#○○○　カラー：シアン　サイズ：S","S"]
["OC-150633","#○○○　カラー：シアン　サイズ：M","M"]
["OC-150634","#○○○　カラー：シアン　サイズ：L","L"]
["OC-150635","#○○○　カラー：シアン　サイズ：XL","XL"]
["OY-150641","#○○○　カラー：イエロー　サイズ：XS","XS"]
["OY-150642","#○○○　カラー：イエロー　サイズ：S","S"]
["OY-150643","#○○○　カラー：イエロー　サイズ：M","M"]
["OY-150644","#○○○　カラー：イエロー　サイズ：L","L"]
["OY-150645","#○○○　カラー：イエロー　サイズ：XL","XL"]